Target
Apoptosis regulator Bcl-2
Ligand
BDBM50397459
Substrate
Meas. Tech.
ChEMBL_862012 (CHEMBL2173962)
IC50
7.7±n/a nM
Citation
 Chen, JZhou, HAguilar, ALiu, LBai, LMcEachern, DYang, CYMeagher, JLStuckey, JAWang, S Structure-based discovery of BM-957 as a potent small-molecule inhibitor of Bcl-2 and Bcl-xL capable of achieving complete tumor regression. J Med Chem 55:8502-14 (2012)  
Target
Name:
Apoptosis regulator Bcl-2
Synonyms:
Apoptosis regulator Bcl-2 Protein BCL-2 BCL2_HUMAN | Bcl-2 Protein
Type:
Homodimer or heterodimer
Mol. Mass.:
26269.11
Organism:
Homo sapiens (Human)
Description:
P10415
Residue:
239
  
Inhibitor
Name:
BDBM50397459
Synonyms:
CHEMBL2170851
Type:
Small organic molecule
Emp. Form.:
C49H50ClF3N6O7S3
Mol. Mass.:
1023.601
SMILES:
Cc1c(C(O)=O)c(c(-c2ccc(Cl)cc2)n1C)-c1cccc(c1)N1CCN(CC1)c1ccc(NS(=O)(=O)c2ccc(N[C@H](CCN3CC(O)C3)CSc3ccccc3)c(c2)S(=O)(=O)C(F)(F)F)cc1
: