Target
Apoptosis regulator Bcl-2
Ligand
BDBM50397466
Substrate
Meas. Tech.
ChEMBL_862012 (CHEMBL2173962)
IC50
828±n/a nM
Citation
 Chen, JZhou, HAguilar, ALiu, LBai, LMcEachern, DYang, CYMeagher, JLStuckey, JAWang, S Structure-based discovery of BM-957 as a potent small-molecule inhibitor of Bcl-2 and Bcl-xL capable of achieving complete tumor regression. J Med Chem 55:8502-14 (2012)  
Target
Name:
Apoptosis regulator Bcl-2
Synonyms:
Apoptosis regulator Bcl-2 Protein BCL-2 BCL2_HUMAN | Bcl-2 Protein
Type:
Homodimer or heterodimer
Mol. Mass.:
26269.11
Organism:
Homo sapiens (Human)
Description:
P10415
Residue:
239
  
Inhibitor
Name:
BDBM50397466
Synonyms:
CHEMBL2170844
Type:
Small organic molecule
Emp. Form.:
C45H54ClN7O5S2
Mol. Mass.:
872.537
SMILES:
CCS(=O)(=O)c1cccc(c1)S(=O)(=O)Nc1ccc(cc1)N1CCN(CC1)c1cccc(c1)-c1c(C(=O)NCCCN2CCN(C)CC2)c(C)n(C)c1-c1ccc(Cl)cc1
: