Target
Prostaglandin G/H synthase 2
Ligand
BDBM50397551
Substrate
Meas. Tech.
ChEMBL_862249 (CHEMBL2172930)
IC50
>100000±n/a nM
Citation
 Favia, ADHabrant, DScarpelli, RMigliore, MAlbani, CBertozzi, SMDionisi, MTarozzo, GPiomelli, DCavalli, ADe Vivo, M Identification and characterization of carprofen as a multitarget fatty acid amide hydrolase/cyclooxygenase inhibitor. J Med Chem 55:8807-26 (2012)  
Target
Name:
Prostaglandin G/H synthase 2
Synonyms:
COX2 Cyclooxygenase 2 (COX-2) Cyclooxygenase-2 (COX-2 AA) Cyclooxygenase-2 (COX-2) PGH2_HUMAN PHS II Prostaglandin E synthase/G/H synthase 2 Prostaglandin-endoperoxide synthase 2
Type:
Enzyme
Mol. Mass.:
69003.89
Organism:
Homo sapiens (Human)
Description:
Recombinant Cox-2 provided by Cayman (Cayman Chemical Co.,Ann Arbor, MI).
Residue:
604
  
Inhibitor
Name:
BDBM50397551
Synonyms:
CHEMBL2171261
Type:
Small organic molecule
Emp. Form.:
C21H24ClNO4S
Mol. Mass.:
421.938
SMILES:
CCCCCCS(=O)(=O)n1c2ccc(Cl)cc2c2ccc(cc12)C(C)C(O)=O
: