Target
Fatty-acid amide hydrolase 1 [30-579]
Ligand
BDBM50397575
Substrate
Meas. Tech.
ChEMBL_862250 (CHEMBL2173027)
IC50
30900±n/a nM
Citation
 Favia, ADHabrant, DScarpelli, RMigliore, MAlbani, CBertozzi, SMDionisi, MTarozzo, GPiomelli, DCavalli, ADe Vivo, M Identification and characterization of carprofen as a multitarget fatty acid amide hydrolase/cyclooxygenase inhibitor. J Med Chem 55:8807-26 (2012)  
Target
Name:
Fatty-acid amide hydrolase 1 [30-579]
Synonyms:
Anandamide amidohydrolase 1 Faah Fatty Acid Amide Hydrolase Fatty-acid amide hydrolase (FAAH) Fatty-acid amide hydrolase 1 (FAAH) Oleamide hydrolase 1
Type:
Single-pass membrane protein; homodimer
Mol. Mass.:
60474.00
Organism:
Rattus norvegicus (rat)
Description:
P97612 (aa 30-579)
Residue:
550
  
Inhibitor
Name:
BDBM50397575
Synonyms:
CHEMBL2171241
Type:
Small organic molecule
Emp. Form.:
C22H15ClFNO3
Mol. Mass.:
395.811
SMILES:
CC(C(O)=O)c1ccc2c(c1)n(C(=O)c1ccc(F)cc1)c1ccc(Cl)cc21
: