Target
Bromodomain-containing protein 3
Ligand
BDBM50397670
Substrate
Meas. Tech.
ChEMBL_873615 (CHEMBL2187904)
IC50
630.96±n/a nM
Citation
 Seal, JLamotte, YDonche, FBouillot, AMirguet, OGellibert, FNicodeme, EKrysa, GKirilovsky, JBeinke, SMcCleary, SRioja, IBamborough, PChung, CWGordon, LLewis, TWalker, ALCutler, LLugo, DWilson, DMWitherington, JLee, KPrinjha, RK Identification of a novel series of BET family bromodomain inhibitors: binding mode and profile of I-BET151 (GSK1210151A). Bioorg Med Chem Lett 22:2968-72 (2012)  
Target
Name:
Bromodomain-containing protein 3
Synonyms:
BRD3 Bromodomain and extra-terminal motif (BET) Bromodomain-containing protein 3 (BRD3) RING3-like protein | RING3L
Type:
Protein
Mol. Mass.:
79571.81
Organism:
Homo sapiens (Human)
Description:
Q15059
Residue:
726
  
Inhibitor
Name:
BDBM50397670
Synonyms:
CHEMBL2181820
Type:
Small organic molecule
Emp. Form.:
C23H21N5O3
Mol. Mass.:
415.4445
SMILES:
COc1cc2c3n([C@@H](C)c4ccccn4)c(=O)[nH]c3cnc2cc1-c1c(C)noc1C
: