Target
Bromodomain-containing protein 2
Ligand
BDBM50380679
Substrate
Meas. Tech.
ChEMBL_873616 (CHEMBL2187905)
IC50
1584.89±n/a nM
Citation
 Seal, JLamotte, YDonche, FBouillot, AMirguet, OGellibert, FNicodeme, EKrysa, GKirilovsky, JBeinke, SMcCleary, SRioja, IBamborough, PChung, CWGordon, LLewis, TWalker, ALCutler, LLugo, DWilson, DMWitherington, JLee, KPrinjha, RK Identification of a novel series of BET family bromodomain inhibitors: binding mode and profile of I-BET151 (GSK1210151A). Bioorg Med Chem Lett 22:2968-72 (2012)  
Target
Name:
Bromodomain-containing protein 2
Synonyms:
BRD2 Bromodomain and extra-terminal motif (BET) Bromodomain-containing protein 2 (BRD2) RING3
Type:
Protein
Mol. Mass.:
88085.95
Organism:
Homo sapiens (Human)
Description:
P25440
Residue:
801
  
Inhibitor
Name:
BDBM50380679
Synonyms:
CHEMBL2017286
Type:
Small organic molecule
Emp. Form.:
C22H19N5O3
Mol. Mass.:
401.418
SMILES:
COc1cc2c3n(Cc4ccccn4)c(=O)[nH]c3cnc2cc1-c1c(C)noc1C
: