Target
Beta-secretase 1
Ligand
BDBM50397706
Substrate
Meas. Tech.
ChEMBL_874114 (CHEMBL2187055)
IC50
3.7±n/a nM
Citation
 Dineen, TAWeiss, MMWilliamson, TActon, PBabu-Khan, SBartberger, MDBrown, JChen, KCheng, YCitron, MCroghan, MDDunn, RTEsmay, JGraceffa, RFHarried, SSHickman, DHitchcock, SAHorne, DBHuang, HImbeah-Ampiah, RJudd, TKaller, MRKreiman, CRLa, DSLi, VLopez, PLouie, SMonenschein, HNguyen, TTPennington, LDSan Miguel, TSickmier, EAVargas, HMWahl, RCWen, PHWhittington, DAWood, SXue, QYang, BHPatel, VFZhong, W Design and synthesis of potent, orally efficacious hydroxyethylamine derivedß-site amyloid precursor protein cleaving enzyme (BACE1) inhibitors. J Med Chem 55:9025-44 (2012)  
Target
Name:
Beta-secretase 1
Synonyms:
ASP2 Aspartyl protease 2 BACE1 Beta-secretase (BACE) Beta-secretase 1 (BACE 1) Beta-secretase 1 (BACE1) Beta-site amyloid precursor protein cleaving enzyme 1 Memapsin-2 beta-Secretase (BACE-1) | beta-Secretase (BACE1)
Type:
Protein
Mol. Mass.:
55755.10
Organism:
Homo sapiens (Human)
Description:
P56817
Residue:
501
  
Inhibitor
Name:
BDBM50397706
Synonyms:
CHEMBL2181908
Type:
Small organic molecule
Emp. Form.:
C31H40N4O3S
Mol. Mass.:
548.739
SMILES:
CC(=O)N[C@@H](Cc1cccc(c1)-c1nccs1)[C@H](O)CN[C@H]1CC2(CCC2)Oc2ncc(CC(C)(C)C)cc12
: