Target
Cytochrome P450 3A4
Ligand
BDBM50397688
Substrate
Meas. Tech.
ChEMBL_874112 (CHEMBL2187053)
IC50
30±n/a nM
Citation
 Dineen, TAWeiss, MMWilliamson, TActon, PBabu-Khan, SBartberger, MDBrown, JChen, KCheng, YCitron, MCroghan, MDDunn, RTEsmay, JGraceffa, RFHarried, SSHickman, DHitchcock, SAHorne, DBHuang, HImbeah-Ampiah, RJudd, TKaller, MRKreiman, CRLa, DSLi, VLopez, PLouie, SMonenschein, HNguyen, TTPennington, LDSan Miguel, TSickmier, EAVargas, HMWahl, RCWen, PHWhittington, DAWood, SXue, QYang, BHPatel, VFZhong, W Design and synthesis of potent, orally efficacious hydroxyethylamine derivedß-site amyloid precursor protein cleaving enzyme (BACE1) inhibitors. J Med Chem 55:9025-44 (2012)  
Target
Name:
Cytochrome P450 3A4
Synonyms:
Albendazole monooxygenase CP3A4_HUMAN CYP3A4 CYPIIIA4 Cytochrome P450 3A4 (CYP3A4) Nifedipine oxidase Taurochenodeoxycholate 6-alpha-hydroxylase
Type:
Enzyme
Mol. Mass.:
57349.57
Organism:
Homo sapiens (Human)
Description:
Residue:
503
  
Inhibitor
Name:
BDBM50397688
Synonyms:
CHEMBL2181896
Type:
Small organic molecule
Emp. Form.:
C31H41N3O4
Mol. Mass.:
519.6749
SMILES:
COCC(=O)N[C@@H](Cc1cccc(c1)C#C)[C@H](O)CN[C@H]1CC2(CCC2)Oc2ncc(CC(C)(C)C)cc12
: