Target
Adenosine receptor A2a
Ligand
BDBM50397724
Substrate
Meas. Tech.
ChEMBL_874132 (CHEMBL2187073)
Ki
33±n/a nM
Citation
 Baraldi, PGPreti, DBorea, PAVarani, K Medicinal chemistry of A3 adenosine receptor modulators: pharmacological activities and therapeutic implications. J Med Chem 55:5676-703 (2012)  
Target
Name:
Adenosine receptor A2a
Synonyms:
AA2AR_RAT Adenosine A2 receptor Adenosine Receptors A2a (A2a) Adenosine receptors A2a Rat striatal adenosine A2a receptor
Type:
G Protein-Coupled Receptor (GPCR)
Mol. Mass.:
45015.65
Organism:
Rattus norvegicus (rat)
Description:
Rat A2A receptors expressed in CHO cells.
Residue:
410
  
Inhibitor
Name:
BDBM50397724
Synonyms:
CHEMBL2181971
Type:
Small organic molecule
Emp. Form.:
C24H23N5O4
Mol. Mass.:
445.4705
SMILES:
OC[C@H]1O[C@H]([C@H](O)[C@@H]1O)n1cnc2c(NCC3c4ccccc4-c4ccccc34)ncnc12
: