Target
Cellular tumor antigen p53
Ligand
BDBM50388626
Substrate
Meas. Tech.
ChEMBL_874346 (CHEMBL2182644)
IC50
760±n/a nM
Citation
 Rew, YSun, DGonzalez-Lopez De Turiso, FBartberger, MDBeck, HPCanon, JChen, AChow, DDeignan, JFox, BMGustin, DHuang, XJiang, MJiao, XJin, LKayser, FKopecky, DJLi, YLo, MCLong, AMMichelsen, KOliner, JDOsgood, TRagains, MSaiki, AYSchneider, SToteva, MYakowec, PYan, XYe, QYu, DZhao, XZhou, JMedina, JCOlson, SH Structure-based design of novel inhibitors of the MDM2-p53 interaction. J Med Chem 55:4936-54 (2012)  
Target
Name:
Cellular tumor antigen p53
Synonyms:
Antigen NY-CO-13 GST-p53 P53 Phosphoprotein p53 Tumor Suppressor p53
Type:
fusion protein
Mol. Mass.:
43654.73
Organism:
Homo sapiens (Human)
Description:
The full-length His6-wt-p53 expressed in E. coli was used in assays.
Residue:
393
  
Inhibitor
Name:
BDBM50388626
Synonyms:
CHEMBL2059435 US9593129, Example 152
Type:
Small organic molecule
Emp. Form.:
C25H29Cl2NO4
Mol. Mass.:
478.408
SMILES:
CC[C@@H]([C@H](C)O)N1[C@@H]([C@H](C[C@](C)(CC(O)=O)C1=O)c1cccc(Cl)c1)c1ccc(Cl)cc1
: