Target
Scavenger receptor class B member 1
Ligand
BDBM50397858
Substrate
Meas. Tech.
ChEMBL_872680 (CHEMBL2184660)
IC50
1.5±n/a nM
Citation
 Mittapalli, GKZhao, FJackson, AGao, HLee, HChow, SKaur, MPNguyen, NZamboni, RMcKelvy, JWong-Staal, FMacdonald, JE Discovery of ITX 4520: a highly potent orally bioavailable hepatitis C virus entry inhibitor. Bioorg Med Chem Lett 22:4955-61 (2012)  
Target
Name:
Scavenger receptor class B member 1
Synonyms:
CD36 and LIMPII analogous 1 CD36L1 CLA-1 Collagen type I receptor, thrombospondin receptor-like 1 SCRB1_HUMAN SRB1
Type:
PROTEIN
Mol. Mass.:
60889.81
Organism:
Homo sapiens (Human)
Description:
ChEMBL_872680
Residue:
552
  
Inhibitor
Name:
BDBM50397858
Synonyms:
CHEMBL2179514
Type:
Small organic molecule
Emp. Form.:
C25H24FN5O
Mol. Mass.:
429.4894
SMILES:
Cc1noc(n1)-c1ccc2n(CCCc3nc4ccc(F)cc4[nH]3)c3CCCCc3c2c1
: