Target
Neuronal acetylcholine receptor subunit alpha-7
Ligand
BDBM50397903
Substrate
Meas. Tech.
ChEMBL_872705 (CHEMBL2184685)
Ki
20±n/a nM
Citation
 Mazurov, AAMiao, LBhatti, BSStrachan, JPAkireddy, SMurthy, SKombo, DXiao, YDHammond, PZhang, JHauser, TAJordan, KGMiller, CHSpeake, JDGatto, GJYohannes, D Discovery of 3-(5-chloro-2-furoyl)-3,7-diazabicyclo[3.3.0]octane (TC-6683, AZD1446), a novel highly selectivea4ß2 nicotinic acetylcholine receptor agonist for the treatment of cognitive disorders. J Med Chem 55:9181-94 (2012)  
Target
Name:
Neuronal acetylcholine receptor subunit alpha-7
Synonyms:
ACHA7_HUMAN Cholinergic, Nicotinic Alpha7 Neuronal acetylcholine receptor protein alpha-7 subunit Nicotinic acetylcholine receptor alpha-7 (alpha7 nAChR)
Type:
Mol. Mass.:
56448.33
Organism:
Homo sapiens (Human)
Description:
CHRNA7 (NACHRA7)
Residue:
502
  
Inhibitor
Name:
BDBM50397903
Synonyms:
CHEMBL2179962
Type:
Small organic molecule
Emp. Form.:
C11H18N2O
Mol. Mass.:
194.2734
SMILES:
O=C(C1CC1)N1CC2CNCC(C2)C1
: