Target
Aminopeptidase N
Ligand
BDBM23973
Substrate
Meas. Tech.
ChEMBL_872717 (CHEMBL2185130)
Ki
120000±n/a nM
Citation
 Albrecht, SSalomon, EDefoin, ATarnus, C Rapid and efficient synthesis of a novel series of substituted aminobenzosuberone derivatives as potent, selective, non-peptidic neutral aminopeptidase inhibitors. Bioorg Med Chem 20:4942-53 (2012)  
Target
Name:
Aminopeptidase N
Synonyms:
AMPN_PIG AP-M Alanyl aminopeptidase Aminopeptidase N (APN) Microsomal aminopeptidase pAPN
Type:
Protein
Mol. Mass.:
108810.25
Organism:
Sus scrofa (Pig)
Description:
P15145
Residue:
963
  
Inhibitor
Name:
BDBM23973
Synonyms:
3-amino-1,2,3,4-tetrahydronaphthalen-2-one hydrochloride | amino-tetralone, 1
Type:
Small organic molecule
Emp. Form.:
C10H11NO
Mol. Mass.:
161.2004
SMILES:
NC1Cc2ccccc2CC1=O
: