Target
Aminopeptidase N
Ligand
BDBM50397948
Substrate
Meas. Tech.
ChEMBL_872710 (CHEMBL2185123)
Ki
1000±n/a nM
Citation
 Albrecht, SSalomon, EDefoin, ATarnus, C Rapid and efficient synthesis of a novel series of substituted aminobenzosuberone derivatives as potent, selective, non-peptidic neutral aminopeptidase inhibitors. Bioorg Med Chem 20:4942-53 (2012)  
Target
Name:
Aminopeptidase N
Synonyms:
AMPN_HUMAN APN Aminopeptidase CD_antigen=CD13 Myeloid plasma membrane glycoprotein CD13 gp150 | hAPN
Type:
PROTEIN
Mol. Mass.:
109522.63
Organism:
Homo sapiens (Human)
Description:
ChEMBL_1507526
Residue:
967
  
Inhibitor
Name:
BDBM50397948
Synonyms:
CHEMBL2179975
Type:
Small organic molecule
Emp. Form.:
C11H13NO
Mol. Mass.:
175.227
SMILES:
N[C@H]1CCc2ccccc2CC1=O
: