Target
P2Y purinoceptor 1
Ligand
BDBM50118242
Substrate
Meas. Tech.
ChEMBL_873672 (CHEMBL2188788)
EC50
2.5±n/a nM
Citation
 Yelovitch, SBarr, HMCamden, JWeisman, GAShai, EVaron, DFischer, B Identification of a promising drug candidate for the treatment of type 2 diabetes based on a P2Y(1) receptor agonist. J Med Chem 55:7623-35 (2012)  
Target
Name:
P2Y purinoceptor 1
Synonyms:
P2RY1 | P2RY1_MELGA
Type:
Mol. Mass.:
41199.64
Organism:
Meleagris gallopavo
Description:
Residue:
362
  
Inhibitor
Name:
BDBM50118242
Synonyms:
((2R,3S,4R,5R)-5-(6-amino-2-(methylthio)-9H-purin-9-yl)-3,4-dihydroxytetrahydrofuran-2-yl)methyl trihydrogen diphosphate 2-MeS-ADP CHEMBL435402 | [({[(2R,3S,4R,5R)-5-[6-amino-2-(methylsulfanyl)-9H-purin-9-yl]-3,4-dihydroxyoxolan-2-yl]methoxy}(hydroxy)phosphoryl)oxy]phosphonic acid
Type:
Small organic molecule
Emp. Form.:
C11H17N5O10P2S
Mol. Mass.:
473.293
SMILES:
CSc1nc(N)c2ncn([C@@H]3O[C@H](COP(O)(=O)OP(O)(O)=O)[C@@H](O)[C@H]3O)c2n1
: