Target
C-X-C chemokine receptor type 1
Ligand
BDBM50200880
Substrate
Meas. Tech.
ChEMBL_875623 (CHEMBL2184854)
IC50
3.9±n/a nM
Citation
 Pease, JHoruk, R Chemokine receptor antagonists. J Med Chem 55:9363-92 (2012)  
Target
Name:
C-X-C chemokine receptor type 1
Synonyms:
C-X-C chemokine receptor type 1 (CXCR-1) CMKAR1 CXCR1_HUMAN Interleukin-8 receptor A | Interleukin-8 receptors, CXCR1/CXCR2
Type:
Enzyme
Mol. Mass.:
39803.83
Organism:
Homo sapiens (Human)
Description:
P25024
Residue:
350
  
Inhibitor
Name:
BDBM50200880
Synonyms:
(R)-2-hydroxy-N,N-dimethyl-3-(2-(1-(5-methylfuran-2-yl)propylamino)-3,4-dioxocyclobut-1-enylamino)benzamide CHEMBL216981 | SCH-527123
Type:
Small organic molecule
Emp. Form.:
C21H23N3O5
Mol. Mass.:
397.4244
SMILES:
CC[C@@H](Nc1c(Nc2cccc(C(=O)N(C)C)c2O)c(=O)c1=O)c1ccc(C)o1
: