Target
C-C chemokine receptor type 3
Ligand
BDBM50209971
Substrate
Meas. Tech.
ChEMBL_875633 (CHEMBL2184864)
IC50
0.034±n/a nM
Citation
 Pease, JHoruk, R Chemokine receptor antagonists. J Med Chem 55:9363-92 (2012)  
Target
Name:
C-C chemokine receptor type 3
Synonyms:
C-C CKR-3 CC-CKR-3 CCR3 CD_antigen=CD193 CMKBR3 | Eosinophil eotaxin receptor
Type:
Enzyme
Mol. Mass.:
41053.88
Organism:
Homo sapiens (Human)
Description:
P51677
Residue:
355
  
Inhibitor
Name:
BDBM50209971
Synonyms:
1-((1R,2S)-2-(((S)-3-(4-fluorobenzyl)piperidin-1-yl)methyl)cyclohexyl)-3-(3-acetylphenyl)urea | CHEMBL250689
Type:
Small organic molecule
Emp. Form.:
C28H36FN3O2
Mol. Mass.:
465.6027
SMILES:
CC(=O)c1cccc(NC(=O)N[C@@H]2CCCC[C@H]2CN2CCC[C@@H](Cc3ccc(F)cc3)C2)c1
: