Target
Inosine-5'-monophosphate dehydrogenase
Ligand
BDBM50398419
Substrate
Meas. Tech.
ChEMBL_872729 (CHEMBL2185142)
IC50
1.000000±n/a nM
Citation
 Gorla, SKKavitha, MZhang, MLiu, XSharling, LGollapalli, DRStriepen, BHedstrom, LCuny, GD Selective and potent urea inhibitors of cryptosporidium parvum inosine 5'-monophosphate dehydrogenase. J Med Chem 55:7759-71 (2012)  
Target
Name:
Inosine-5'-monophosphate dehydrogenase
Synonyms:
Cgd6_20 protein Inosine-5'-monophosphate dehydrogenase, probable | Inosine-5-monophosphate dehydrogenase (IMPDH)
Type:
Protein
Mol. Mass.:
43076.80
Organism:
Cryptosporidium parvum
Description:
Q8T6T2
Residue:
400
  
Inhibitor
Name:
BDBM50398419
Synonyms:
CHEMBL2178618
Type:
Small organic molecule
Emp. Form.:
C22H23N3O2
Mol. Mass.:
361.4369
SMILES:
CC(N=O)c1cccc(c1)C(C)(C)NC(=O)Nc1ccc2ccccc2c1
: