Target
Inosine-5'-monophosphate dehydrogenase
Ligand
BDBM50398422
Substrate
Meas. Tech.
ChEMBL_872728 (CHEMBL2185141)
IC50
13±n/a nM
Citation
 Gorla, SKKavitha, MZhang, MLiu, XSharling, LGollapalli, DRStriepen, BHedstrom, LCuny, GD Selective and potent urea inhibitors of cryptosporidium parvum inosine 5'-monophosphate dehydrogenase. J Med Chem 55:7759-71 (2012)  
Target
Name:
Inosine-5'-monophosphate dehydrogenase
Synonyms:
Cgd6_20 protein Inosine-5'-monophosphate dehydrogenase, probable | Inosine-5-monophosphate dehydrogenase (IMPDH)
Type:
Protein
Mol. Mass.:
43076.80
Organism:
Cryptosporidium parvum
Description:
Q8T6T2
Residue:
400
  
Inhibitor
Name:
BDBM50398422
Synonyms:
CHEMBL2178622
Type:
Small organic molecule
Emp. Form.:
C23H25N3O2
Mol. Mass.:
375.4635
SMILES:
CO\N=C(/C)c1cccc(c1)C(C)(C)NC(=O)Nc1ccc2ccccc2c1
: