Target
Transient receptor potential cation channel subfamily V member 1
Ligand
BDBM50398536
Substrate
Meas. Tech.
ChEMBL_872981 (CHEMBL2188275)
Ki
0.7±n/a nM
Citation
 Kim, MSRyu, HKang, DWCho, SHSeo, SPark, YSKim, MYKwak, EJKim, YSBhondwe, RSKim, HSPark, SGSon, KChoi, SDeAndrea-Lazarus, IAPearce, LVBlumberg, PMFrank, RBahrenberg, GStockhausen, HKögel, BYSchiene, KChristoph, TLee, J 2-(3-fluoro-4-methylsulfonylaminophenyl)propanamides as potent transient receptor potential vanilloid 1 (TRPV1) antagonists: structure-activity relationships of 2-amino derivatives in the N-(6-trifluoromethylpyridin-3-ylmethyl) C-region. J Med Chem 55:8392-408 (2012)  
Target
Name:
Transient receptor potential cation channel subfamily V member 1
Synonyms:
Capsaicin receptor Osm-9-like TRP channel 1 TRPV1_HUMAN Transient receptor potential cation channel subfamily V member 1 (TRPV1) Transient receptor potential cation channel subfamily V member 1(TRPV1) Vanilloid VR1 Vanilloid receptor 1 Vanilloid receptor 1 (VRI/TRPV1)
Type:
Protein
Mol. Mass.:
94960.75
Organism:
Homo sapiens (Human)
Description:
Q8NER1
Residue:
839
  
Inhibitor
Name:
BDBM50398536
Synonyms:
CHEMBL2177419
Type:
Small organic molecule
Emp. Form.:
C24H30F4N4O3S
Mol. Mass.:
530.579
SMILES:
CC(C(=O)NCc1ccc(nc1N1CCCCCCC1)C(F)(F)F)c1ccc(NS(C)(=O)=O)c(F)c1
: