Target
Glycogen synthase kinase-3 alpha
Ligand
BDBM50347750
Substrate
Meas. Tech.
ChEMBL_875246 (CHEMBL2187128)
IC50
210±n/a nM
Citation
 Tahtouh, TElkins, JMFilippakopoulos, PSoundararajan, MBurgy, GDurieu, ECochet, CSchmid, RSLo, DCDelhommel, FOberholzer, AEPearl, LHCarreaux, FBazureau, JPKnapp, SMeijer, L Selectivity, cocrystal structures, and neuroprotective properties of leucettines, a family of protein kinase inhibitors derived from the marine sponge alkaloid leucettamine B. J Med Chem 55:9312-30 (2012)  
Target
Name:
Glycogen synthase kinase-3 alpha
Synonyms:
GSK-3 alpha GSK3A_HUMAN Glycogen synthase kinase-3 Glycogen synthase kinase-3 alpha (GSK3 Alpha) Glycogen synthase kinase-3 alpha (GSK3alpha)
Type:
Enzyme
Mol. Mass.:
50991.79
Organism:
Homo sapiens (Human)
Description:
P49840
Residue:
483
  
Inhibitor
Name:
BDBM50347750
Synonyms:
CHEMBL1802358
Type:
Small organic molecule
Emp. Form.:
C17H13N3O3
Mol. Mass.:
307.3034
SMILES:
O=C1NC(Nc2ccccc2)=NC1=Cc1ccc2OCOc2c1
: