Target
Dual specificity protein kinase CLK4
Ligand
BDBM50347750
Substrate
Meas. Tech.
ChEMBL_875429 (CHEMBL2182296)
IC50
64±n/a nM
Citation
 Tahtouh, TElkins, JMFilippakopoulos, PSoundararajan, MBurgy, GDurieu, ECochet, CSchmid, RSLo, DCDelhommel, FOberholzer, AEPearl, LHCarreaux, FBazureau, JPKnapp, SMeijer, L Selectivity, cocrystal structures, and neuroprotective properties of leucettines, a family of protein kinase inhibitors derived from the marine sponge alkaloid leucettamine B. J Med Chem 55:9312-30 (2012)  
Target
Name:
Dual specificity protein kinase CLK4
Synonyms:
CDC-like kinase 4 Clk4
Type:
PROTEIN
Mol. Mass.:
57374.39
Organism:
Mus musculus
Description:
ChEMBL_1502248
Residue:
481
  
Inhibitor
Name:
BDBM50347750
Synonyms:
CHEMBL1802358
Type:
Small organic molecule
Emp. Form.:
C17H13N3O3
Mol. Mass.:
307.3034
SMILES:
O=C1NC(Nc2ccccc2)=NC1=Cc1ccc2OCOc2c1
: