Target
Beta-secretase 1
Ligand
BDBM50398767
Substrate
Meas. Tech.
ChEMBL_872807 (CHEMBL2186066)
IC50
79±n/a nM
Citation
 Gravenfors, YViklund, JBlid, JGinman, TKarlström, SKihlström, JKolmodin, KLindström, Jvon Berg, Svon Kieseritzky, FBogar, KSlivo, CSwahn, BMOlsson, LLJohansson, PEketjäll, SFälting, JJeppsson, FStrömberg, KJanson, JRahm, F New aminoimidazoles asß-secretase (BACE-1) inhibitors showing amyloid-ß (Aß) lowering in brain. J Med Chem 55:9297-311 (2012)  
Target
Name:
Beta-secretase 1
Synonyms:
ASP2 Aspartyl protease 2 BACE1 Beta-secretase (BACE) Beta-secretase 1 (BACE 1) Beta-secretase 1 (BACE1) Beta-site amyloid precursor protein cleaving enzyme 1 Memapsin-2 beta-Secretase (BACE-1) | beta-Secretase (BACE1)
Type:
Protein
Mol. Mass.:
55755.10
Organism:
Homo sapiens (Human)
Description:
P56817
Residue:
501
  
Inhibitor
Name:
BDBM50398767
Synonyms:
CHEMBL2180037
Type:
Small organic molecule
Emp. Form.:
C21H20N4
Mol. Mass.:
328.4103
SMILES:
CC#Cc1cncc(c1)-c1cccc(c1)C1(N=C(C)C(N)=N1)C1CC1
: