Target
Glutamate carboxypeptidase 2
Ligand
BDBM50398811
Substrate
Meas. Tech.
ChEMBL_873320 (CHEMBL2185173)
Ki
1.4±n/a nM
Citation
 Graham, KLesche, RGromov, AVBöhnke, NSchäfer, MHassfeld, JDinkelborg, LKettschau, G Radiofluorinated derivatives of 2-(phosphonomethyl)pentanedioic acid as inhibitors of prostate specific membrane antigen (PSMA) for the imaging of prostate cancer. J Med Chem 55:9510-20 (2012)  
Target
Name:
Glutamate carboxypeptidase 2
Synonyms:
FGCP FOLH1 Folate hydrolase 1 Glutamate carboxypeptidase 2 Membrane glutamate carboxypeptidase NAALAD1 PSM Prostate-specific membrane antigen mGCP
Type:
PROTEIN
Mol. Mass.:
84333.66
Organism:
Homo sapiens (Human)
Description:
ChEMBL_1497035
Residue:
750
  
Inhibitor
Name:
BDBM50398811
Synonyms:
CHEMBL2177507
Type:
Small organic molecule
Emp. Form.:
C6H10FO7P
Mol. Mass.:
244.1116
SMILES:
OC(=O)[C@@H](F)C[C@H](CP(O)(O)=O)C(O)=O
: