Target
Glutamate carboxypeptidase 2
Ligand
BDBM17759
Substrate
Meas. Tech.
ChEMBL_873321 (CHEMBL2185174)
Ki
0.1±n/a nM
Citation
 Graham, KLesche, RGromov, AVBöhnke, NSchäfer, MHassfeld, JDinkelborg, LKettschau, G Radiofluorinated derivatives of 2-(phosphonomethyl)pentanedioic acid as inhibitors of prostate specific membrane antigen (PSMA) for the imaging of prostate cancer. J Med Chem 55:9510-20 (2012)  
Target
Name:
Glutamate carboxypeptidase 2
Synonyms:
FGCP FOLH1 Folate hydrolase 1 Glutamate carboxypeptidase 2 Membrane glutamate carboxypeptidase NAALAD1 PSM Prostate-specific membrane antigen mGCP
Type:
PROTEIN
Mol. Mass.:
84333.66
Organism:
Homo sapiens (Human)
Description:
ChEMBL_1497035
Residue:
750
  
Inhibitor
Name:
BDBM17759
Synonyms:
(2S)-2-(phosphonomethyl)pentanedioic acid pentanedioic acid analogue, (S)-1
Type:
Small organic molecule
Emp. Form.:
C6H11O7P
Mol. Mass.:
226.1211
SMILES:
OC(=O)CC[C@H](CP(O)(O)=O)C(O)=O
: