Target
Mu-type opioid receptor
Ligand
BDBM50398946
Substrate
Meas. Tech.
ChEMBL_875495 (CHEMBL2183136)
Ki
0.7±n/a nM
Citation
 Moynihan, HADerrick, IBroadbear, JHGreedy, BMAceto, MDHarris, LSPurington, LCThomas, MPWoods, JHTraynor, JRHusbands, SMLewis, JW Fumaroylamino-4,5-epoxymorphinans and related opioids with irreversibleµ opioid receptor antagonist effects. J Med Chem 55:9868-74 (2012)  
Target
Name:
Mu-type opioid receptor
Synonyms:
M-OR-1 Mu opioid receptor OPIATE Mu OPRM_CAVPO
Type:
Enzyme Catalytic Domain
Mol. Mass.:
11165.58
Organism:
GUINEA PIG
Description:
P97266
Residue:
98
  
Inhibitor
Name:
BDBM50398946
Synonyms:
CHEMBL2179263
Type:
Small organic molecule
Emp. Form.:
C33H38N2O4
Mol. Mass.:
526.6658
SMILES:
CO[C@]12CC[C@@]3(C[C@@H]1CNC(=O)\C=C\c1ccccc1)[C@H]1Cc4ccc(O)c5O[C@@H]2[C@]3(CCN1CC1CC1)c45
: