Target
5-hydroxytryptamine receptor 2A
Ligand
BDBM50398979
Substrate
Meas. Tech.
ChEMBL_875037 (CHEMBL2184355)
Ki
>1000±n/a nM
Citation
 Furlotti, GAlisi, MAApicella, CCapezzone de Joannon, ACazzolla, NCosti, RCuzzucoli Crucitti, GGarrone, BIacovo, AMagarò, GMangano, GMiele, GOmbrato, RPescatori, LPolenzani, LRosi, FVitiello, MDi Santo, R Discovery and pharmacological profile of new 1H-indazole-3-carboxamide and 2H-pyrrolo[3,4-c]quinoline derivatives as selective serotonin 4 receptor ligands. J Med Chem 55:9446-66 (2012)  
Target
Name:
5-hydroxytryptamine receptor 2A
Synonyms:
5-HT-2 5-HT2A 5-hydroxytryptamine receptor 2A (5HT-2A) 5HT2A_HUMAN HTR2A | Serotonin receptor 2A
Type:
undefined
Mol. Mass.:
52607.65
Organism:
Homo sapiens (Human)
Description:
P28223
Residue:
471
  
Inhibitor
Name:
BDBM50398979
Synonyms:
CHEMBL2179701
Type:
Small organic molecule
Emp. Form.:
C22H35N5O
Mol. Mass.:
385.5462
SMILES:
CC(C)n1nc(C(=O)NCC2CCN(CCCN(C)C)CC2)c2ccccc12
: