Target
Tyrosine-protein kinase JAK2
Ligand
BDBM50399015
Substrate
Meas. Tech.
ChEMBL_874063 (CHEMBL2186596)
Ki
0.1±n/a nM
Citation
 Hanan, EJvan Abbema, ABarrett, KBlair, WSBlaney, JChang, CEigenbrot, CFlynn, SGibbons, PHurley, CAKenny, JRKulagowski, JLee, LMagnuson, SRMorris, CMurray, JPastor, RMRawson, TSiu, MUltsch, MZhou, ASampath, DLyssikatos, JP Discovery of potent and selective pyrazolopyrimidine janus kinase 2 inhibitors. J Med Chem 55:10090-107 (2012)  
Target
Name:
Tyrosine-protein kinase JAK2
Synonyms:
JAK-2 JAK2_HUMAN Janus kinase 2 (JAK2) | Janus kinase 2 (a protein tyrosine kinase)
Type:
Protein
Mol. Mass.:
130684.68
Organism:
Homo sapiens (Human)
Description:
O60674
Residue:
1132
  
Inhibitor
Name:
BDBM50399015
Synonyms:
CHEMBL2178804
Type:
Small organic molecule
Emp. Form.:
C17H13Cl2N7O
Mol. Mass.:
402.237
SMILES:
Cn1cc(NC(=O)c2cnn3ccc(N)nc23)c(n1)-c1cc(Cl)ccc1Cl
: