Target
Carbonic anhydrase 14
Ligand
BDBM50399077
Substrate
Meas. Tech.
ChEMBL_878778 (CHEMBL2183718)
Ki
548±n/a nM
Citation
 Marini, AMMaresca, AAggarwal, MOrlandini, ENencetti, SDa Settimo, FSalerno, SSimorini, FLa Motta, CTaliani, SNuti, EScozzafava, AMcKenna, RRossello, ASupuran, CT Tricyclic sulfonamides incorporating benzothiopyrano[4,3-c]pyrazole and pyridothiopyrano[4,3-c]pyrazole effectively inhibita- andß-carbonic anhydrase: X-ray crystallography and solution investigations on 15 isoforms. J Med Chem 55:9619-29 (2012)  
Target
Name:
Carbonic anhydrase 14
Synonyms:
CA-XIV CAH14_HUMAN Carbonic Anhydrase XIV Carbonic anhydrase 14 Carbonic anhydrase XIV (CA XIV)
Type:
Enzyme
Mol. Mass.:
37665.67
Organism:
Homo sapiens (Human)
Description:
Human (cloned) isozyme.
Residue:
337
  
Inhibitor
Name:
BDBM50399077
Synonyms:
CHEMBL2179306
Type:
Small organic molecule
Emp. Form.:
C17H12F3N3O2S2
Mol. Mass.:
411.421
SMILES:
NS(=O)(=O)c1ccc(cc1)-n1ncc2CSc3cc(ccc3-c12)C(F)(F)F
: