Target
Carbonic anhydrase
Ligand
BDBM50399078
Substrate
Meas. Tech.
ChEMBL_878775 (CHEMBL2183715)
Ki
316±n/a nM
Citation
 Marini, AMMaresca, AAggarwal, MOrlandini, ENencetti, SDa Settimo, FSalerno, SSimorini, FLa Motta, CTaliani, SNuti, EScozzafava, AMcKenna, RRossello, ASupuran, CT Tricyclic sulfonamides incorporating benzothiopyrano[4,3-c]pyrazole and pyridothiopyrano[4,3-c]pyrazole effectively inhibita- andß-carbonic anhydrase: X-ray crystallography and solution investigations on 15 isoforms. J Med Chem 55:9619-29 (2012)  
Target
Name:
Carbonic anhydrase
Synonyms:
PROBABLE TRANSMEMBRANE CARBONIC ANHYDRASE (CARBONATE DEHYDRATASE) (CARBONIC DEHYDRATASE)
Type:
PROTEIN
Mol. Mass.:
80567.22
Organism:
Mycobacterium tuberculosis
Description:
ChEMBL_878775
Residue:
764
  
Inhibitor
Name:
BDBM50399078
Synonyms:
CHEMBL2179307
Type:
Small organic molecule
Emp. Form.:
C16H12ClN3O2S2
Mol. Mass.:
377.868
SMILES:
NS(=O)(=O)c1ccc(cc1)-n1ncc2CSc3cc(Cl)ccc3-c12
: