Target
Carbonic anhydrase 4
Ligand
BDBM50399078
Substrate
Meas. Tech.
ChEMBL_878786 (CHEMBL2183726)
Ki
7200±n/a nM
Citation
 Marini, AMMaresca, AAggarwal, MOrlandini, ENencetti, SDa Settimo, FSalerno, SSimorini, FLa Motta, CTaliani, SNuti, EScozzafava, AMcKenna, RRossello, ASupuran, CT Tricyclic sulfonamides incorporating benzothiopyrano[4,3-c]pyrazole and pyridothiopyrano[4,3-c]pyrazole effectively inhibita- andß-carbonic anhydrase: X-ray crystallography and solution investigations on 15 isoforms. J Med Chem 55:9619-29 (2012)  
Target
Name:
Carbonic anhydrase 4
Synonyms:
CA-IV CAH4_HUMAN Carbonic anhydrase Carbonic anhydrase IV (CA IV)
Type:
Enzyme
Mol. Mass.:
35037.98
Organism:
Homo sapiens (Human)
Description:
P22748
Residue:
312
  
Inhibitor
Name:
BDBM50399078
Synonyms:
CHEMBL2179307
Type:
Small organic molecule
Emp. Form.:
C16H12ClN3O2S2
Mol. Mass.:
377.868
SMILES:
NS(=O)(=O)c1ccc(cc1)-n1ncc2CSc3cc(Cl)ccc3-c12
: