Target
Carbonic anhydrase 6
Ligand
BDBM50399079
Substrate
Meas. Tech.
ChEMBL_878783 (CHEMBL2183723)
Ki
7116±n/a nM
Citation
 Marini, AMMaresca, AAggarwal, MOrlandini, ENencetti, SDa Settimo, FSalerno, SSimorini, FLa Motta, CTaliani, SNuti, EScozzafava, AMcKenna, RRossello, ASupuran, CT Tricyclic sulfonamides incorporating benzothiopyrano[4,3-c]pyrazole and pyridothiopyrano[4,3-c]pyrazole effectively inhibita- andß-carbonic anhydrase: X-ray crystallography and solution investigations on 15 isoforms. J Med Chem 55:9619-29 (2012)  
Target
Name:
Carbonic anhydrase 6
Synonyms:
CA-VI CAH6_HUMAN Carbonic Anhydrase VI Carbonic anhydrase 6 Carbonic anhydrase 6 (CA-VI) Salivary carbonic anhydrase | Secreted carbonic anhydrase
Type:
Enzyme
Mol. Mass.:
35371.40
Organism:
Homo sapiens (Human)
Description:
P23280
Residue:
308
  
Inhibitor
Name:
BDBM50399079
Synonyms:
CHEMBL2179308
Type:
Small organic molecule
Emp. Form.:
C17H15N3O3S2
Mol. Mass.:
373.449
SMILES:
COc1ccc2-c3c(CSc2c1)cnn3-c1ccc(cc1)S(N)(=O)=O
: