Target
Metabotropic glutamate receptor 2
Ligand
BDBM50399096
Substrate
Meas. Tech.
ChEMBL_879037 (CHEMBL2186482)
EC50
468±n/a nM
Citation
 Cid, JMTresadern, GVega, JAde Lucas, AIMatesanz, EIturrino, LLinares, MLGarcia, AAndrés, JIMacdonald, GJOehlrich, DLavreysen, HMegens, AAhnaou, ADrinkenburg, WMackie, CPype, SGallacher, DTrabanco, AA Discovery of 3-cyclopropylmethyl-7-(4-phenylpiperidin-1-yl)-8-trifluoromethyl[1,2,4]triazolo[4,3-a]pyridine (JNJ-42153605): a positive allosteric modulator of the metabotropic glutamate 2 receptor. J Med Chem 55:8770-89 (2012)  
Target
Name:
Metabotropic glutamate receptor 2
Synonyms:
GPRC1B GRM2_HUMAN Metabotropic glutamate receptor mGlu2 | metabotropic glutamate 2
Type:
Enzyme
Mol. Mass.:
95584.88
Organism:
Homo sapiens (Human)
Description:
Q14416
Residue:
872
  
Inhibitor
Name:
BDBM50399096
Synonyms:
CHEMBL2179311
Type:
Small organic molecule
Emp. Form.:
C20H21N5O
Mol. Mass.:
347.4136
SMILES:
COCc1nnc2c(C#N)c(ccn12)N1CCC(CC1)c1ccccc1
: