Target
P2X purinoceptor 3
Ligand
BDBM50399183
Substrate
Meas. Tech.
ChEMBL_876872 (CHEMBL2184466)
IC50
>10000±n/a nM
Citation
 Hernandez-Olmos, VAbdelrahman, AEl-Tayeb, AFreudendahl, DWeinhausen, SMüller, CE N-substituted phenoxazine and acridone derivatives: structure-activity relationships of potent P2X4 receptor antagonists. J Med Chem 55:9576-88 (2012)  
Target
Name:
P2X purinoceptor 3
Synonyms:
ATP receptor P2RX3 P2X purinoceptor 3 P2X purinoceptor 3 (P2X3) P2X3 purinoceptor p2x3 + hsa
Type:
Protein
Mol. Mass.:
44292.02
Organism:
Homo sapiens (Human)
Description:
P56373
Residue:
397
  
Inhibitor
Name:
BDBM50399183
Synonyms:
CHEMBL2180160
Type:
Small organic molecule
Emp. Form.:
C19H15NO3S
Mol. Mass.:
337.392
SMILES:
Cc1ccc(cc1)S(=O)(=O)N1c2ccccc2Oc2ccccc12
: