Target
P2X purinoceptor 4
Ligand
BDBM50399183
Substrate
Meas. Tech.
ChEMBL_876875 (CHEMBL2184469)
IC50
1760±n/a nM
Citation
 Hernandez-Olmos, VAbdelrahman, AEl-Tayeb, AFreudendahl, DWeinhausen, SMüller, CE N-substituted phenoxazine and acridone derivatives: structure-activity relationships of potent P2X4 receptor antagonists. J Med Chem 55:9576-88 (2012)  
Target
Name:
P2X purinoceptor 4
Synonyms:
ATP receptor P2rx4 Purinergic receptor
Type:
PROTEIN
Mol. Mass.:
43443.55
Organism:
Mus musculus
Description:
ChEMBL_1283887
Residue:
388
  
Inhibitor
Name:
BDBM50399183
Synonyms:
CHEMBL2180160
Type:
Small organic molecule
Emp. Form.:
C19H15NO3S
Mol. Mass.:
337.392
SMILES:
Cc1ccc(cc1)S(=O)(=O)N1c2ccccc2Oc2ccccc12
: