Target
Proto-oncogene tyrosine-protein kinase receptor Ret
Ligand
BDBM50399535
Substrate
Meas. Tech.
ChEMBL_878298 (CHEMBL2185926)
IC50
5±n/a nM
Citation
 Musumeci, FRadi, MBrullo, CSchenone, S Vascular endothelial growth factor (VEGF) receptors: drugs and new inhibitors. J Med Chem 55:10797-822 (2012)  
Target
Name:
Proto-oncogene tyrosine-protein kinase receptor Ret
Synonyms:
CDHF12 Cadherin family member 12 Proto-oncogene c-Ret RET51 Tyrosine-protein kinase Ret (RET)
Type:
Protein
Mol. Mass.:
124318.29
Organism:
Homo sapiens (Human)
Description:
P07949
Residue:
1114
  
Inhibitor
Name:
BDBM50399535
Synonyms:
CHEMBL2180602
Type:
Small organic molecule
Emp. Form.:
C24H29FN4O2
Mol. Mass.:
424.5111
SMILES:
CCN(CC)CCNC(=O)c1c(C)[nH]c2c1CCC\C2=C1\C(=O)Nc2ccc(F)cc12
: