Target
Histone deacetylase 8
Ligand
BDBM19149
Substrate
Meas. Tech.
ChEMBL_878900 (CHEMBL2185051)
IC50
1500±n/a nM
Citation
 Suzuki, TOta, YRi, MBando, MGotoh, AItoh, YTsumoto, HTatum, PRMizukami, TNakagawa, HIida, SUeda, RShirahige, KMiyata, N Rapid discovery of highly potent and selective inhibitors of histone deacetylase 8 using click chemistry to generate candidate libraries. J Med Chem 55:9562-75 (2012)  
Target
Name:
Histone deacetylase 8
Synonyms:
HD8 HDAC8_HUMAN Histone deacetylase 8 (HDAC-8) | Human HDAC8
Type:
Enzyme
Mol. Mass.:
41749.60
Organism:
Homo sapiens (Human)
Description:
Q9BY41
Residue:
377
  
Inhibitor
Name:
BDBM19149
Synonyms:
CHEMBL98 SAHA US10188756, Compound SAHA US11505523, Compound SAHA US9353061, SAHA US9695181, Vorinostat Zolinza suberoylanilide hydroxamic acid
Type:
Small organic molecule
Emp. Form.:
C14H20N2O3
Mol. Mass.:
264.3202
SMILES:
ONC(=O)CCCCCCC(=O)Nc1ccccc1
: