Target
Serine/threonine-protein kinase WNK1
Ligand
BDBM50399676
Substrate
Meas. Tech.
ChEMBL_876549 (CHEMBL2188506)
IC50
>10000±n/a nM
Citation
 Yang, JWang, LJLiu, JJZhong, LZheng, RLXu, YJi, PZhang, CHWang, WJLin, XDLi, LLWei, YQYang, SY Structural optimization and structure-activity relationships of N2-(4-(4-Methylpiperazin-1-yl)phenyl)-N8-phenyl-9H-purine-2,8-diamine derivatives, a new class of reversible kinase inhibitors targeting both EGFR-activating and resistance mutations. J Med Chem 55:10685-99 (2012)  
Target
Name:
Serine/threonine-protein kinase WNK1
Synonyms:
Erythrocyte 65 kDa protein KDP Kinase deficient protein Protein kinase lysine-deficient 1 WNK1 hWNK1 | p65
Type:
PROTEIN
Mol. Mass.:
250784.18
Organism:
Homo sapiens (Human)
Description:
ChEMBL_876549
Residue:
2382
  
Inhibitor
Name:
BDBM50399676
Synonyms:
CHEMBL2178352 | US9096601, 8-26
Type:
Small organic molecule
Emp. Form.:
C27H32N8
Mol. Mass.:
468.5966
SMILES:
CN1CCN(CC1)c1ccc(Nc2ncc3nc(Nc4ccccc4)n(C4CCCC4)c3n2)cc1
: