Target
RAC-alpha serine/threonine-protein kinase
Ligand
BDBM50399676
Substrate
Meas. Tech.
ChEMBL_876557 (CHEMBL2188514)
IC50
>10000±n/a nM
Citation
 Yang, JWang, LJLiu, JJZhong, LZheng, RLXu, YJi, PZhang, CHWang, WJLin, XDLi, LLWei, YQYang, SY Structural optimization and structure-activity relationships of N2-(4-(4-Methylpiperazin-1-yl)phenyl)-N8-phenyl-9H-purine-2,8-diamine derivatives, a new class of reversible kinase inhibitors targeting both EGFR-activating and resistance mutations. J Med Chem 55:10685-99 (2012)  
Target
Name:
RAC-alpha serine/threonine-protein kinase
Synonyms:
AKT phosphorylation (p-AKT) AKT1/PPP1CA C-AKT PKB alpha Protein kinase B Protein kinase B (Akt 1) Protein kinase B alpha Proto-oncogene Akt (Akt1) Proto-oncogene c-Akt (AKT1) RAC-PK-alpha RAC-alpha serine/threonine-protein kinase (AKT1) | RAC-alpha serine/threonine-protein kinase (pAKT)
Type:
Enzyme
Mol. Mass.:
55681.25
Organism:
Homo sapiens (Human)
Description:
P31749
Residue:
480
  
Inhibitor
Name:
BDBM50399676
Synonyms:
CHEMBL2178352 | US9096601, 8-26
Type:
Small organic molecule
Emp. Form.:
C27H32N8
Mol. Mass.:
468.5966
SMILES:
CN1CCN(CC1)c1ccc(Nc2ncc3nc(Nc4ccccc4)n(C4CCCC4)c3n2)cc1
: