Target
Proto-oncogene tyrosine-protein kinase Src
Ligand
BDBM50399676
Substrate
Meas. Tech.
ChEMBL_876576 (CHEMBL2188533)
IC50
290±n/a nM
Citation
 Yang, JWang, LJLiu, JJZhong, LZheng, RLXu, YJi, PZhang, CHWang, WJLin, XDLi, LLWei, YQYang, SY Structural optimization and structure-activity relationships of N2-(4-(4-Methylpiperazin-1-yl)phenyl)-N8-phenyl-9H-purine-2,8-diamine derivatives, a new class of reversible kinase inhibitors targeting both EGFR-activating and resistance mutations. J Med Chem 55:10685-99 (2012)  
Target
Name:
Proto-oncogene tyrosine-protein kinase Src
Synonyms:
Calmodulin/Proto-oncogene tyrosine-protein kinase Src Proto-oncogene c-Src SRC SRC_HUMAN V-src sarcoma (Schmidt-Ruppin A-2) viral oncogene homolog (avian) p60-Src | pp60c-src
Type:
Protein
Mol. Mass.:
59838.60
Organism:
Homo sapiens (Human)
Description:
P12931
Residue:
536
  
Inhibitor
Name:
BDBM50399676
Synonyms:
CHEMBL2178352 | US9096601, 8-26
Type:
Small organic molecule
Emp. Form.:
C27H32N8
Mol. Mass.:
468.5966
SMILES:
CN1CCN(CC1)c1ccc(Nc2ncc3nc(Nc4ccccc4)n(C4CCCC4)c3n2)cc1
: