Target
Macrophage-stimulating protein receptor
Ligand
BDBM50399676
Substrate
Meas. Tech.
ChEMBL_876729 (CHEMBL2183200)
IC50
>10000±n/a nM
Citation
 Yang, JWang, LJLiu, JJZhong, LZheng, RLXu, YJi, PZhang, CHWang, WJLin, XDLi, LLWei, YQYang, SY Structural optimization and structure-activity relationships of N2-(4-(4-Methylpiperazin-1-yl)phenyl)-N8-phenyl-9H-purine-2,8-diamine derivatives, a new class of reversible kinase inhibitors targeting both EGFR-activating and resistance mutations. J Med Chem 55:10685-99 (2012)  
Target
Name:
Macrophage-stimulating protein receptor
Synonyms:
2.7.10.1 CDw136 MST1R Macrophage-stimulating protein receptor alpha chain PTK8 RON Tyrosine kinase receptor ron | p185-Ron
Type:
Protein
Mol. Mass.:
152270.76
Organism:
Homo sapiens (Human)
Description:
Q04912
Residue:
1400
  
Inhibitor
Name:
BDBM50399676
Synonyms:
CHEMBL2178352 | US9096601, 8-26
Type:
Small organic molecule
Emp. Form.:
C27H32N8
Mol. Mass.:
468.5966
SMILES:
CN1CCN(CC1)c1ccc(Nc2ncc3nc(Nc4ccccc4)n(C4CCCC4)c3n2)cc1
: