Target
Glutaminase kidney isoform, mitochondrial
Ligand
BDBM50400071
Substrate
Meas. Tech.
ChEMBL_878001 (CHEMBL2189067)
IC50
>100000±n/a nM
Citation
 Shukla, KFerraris, DVThomas, AGStathis, MDuvall, BDelahanty, GAlt, JRais, RRojas, CGao, PXiang, YDang, CVSlusher, BSTsukamoto, T Design, synthesis, and pharmacological evaluation of bis-2-(5-phenylacetamido-1,2,4-thiadiazol-2-yl)ethyl sulfide 3 (BPTES) analogs as glutaminase inhibitors. J Med Chem 55:10551-63 (2012)  
Target
Name:
Glutaminase kidney isoform, mitochondrial
Synonyms:
GLS GLSK_HUMAN K-glutaminase L-glutamine amidohydrolase
Type:
Protein
Mol. Mass.:
73471.89
Organism:
Homo sapiens (Human)
Description:
O94925
Residue:
669
  
Inhibitor
Name:
BDBM50400071
Synonyms:
CHEMBL2178397
Type:
Small organic molecule
Emp. Form.:
C17H20N6OS2
Mol. Mass.:
388.51
SMILES:
Nc1nnc(CCCCc2nnc(NC(=O)CCc3ccccc3)s2)s1
: