Target
Hypoxia-inducible factor 1-alpha
Ligand
BDBM50400085
Substrate
Meas. Tech.
ChEMBL_878081 (CHEMBL2183271)
IC50
820±n/a nM
Citation
 Naik, RWon, MKim, BKXia, YChoi, HKJin, GJung, YKim, HMLee, K Synthesis and structure-activity relationship of (E)-phenoxyacrylic amide derivatives as hypoxia-inducible factor (HIF) 1a inhibitors. J Med Chem 55:10564-71 (2012)  
Target
Name:
Hypoxia-inducible factor 1-alpha
Synonyms:
BHLHE78 HIF-1-alpha, HIF-2-alpha HIF1A_HUMAN Hypoxia-inducible factor 1 alpha MOP1 von Hippel-Lindau disease tumor suppressor/Elongin-C/Elongin-B/HIF1A
Type:
Protein
Mol. Mass.:
92647.24
Organism:
Homo sapiens (Human)
Description:
Q16665
Residue:
826
  
Inhibitor
Name:
BDBM50400085
Synonyms:
CHEMBL2178416
Type:
Small organic molecule
Emp. Form.:
C28H31NO4
Mol. Mass.:
445.55
SMILES:
CCOC(=O)c1cccc(NC(=O)\C=C\Oc2ccc(cc2)C23CC4CC(CC(C4)C2)C3)c1
: