Target
Amine oxidase [flavin-containing] B
Ligand
BDBM50400103
Substrate
Meas. Tech.
ChEMBL_878114 (CHEMBL2183304)
Ki
548±n/a nM
Citation
 Abdelhafez, OMAmin, KMAli, HIAbdalla, MMBatran, RZ Synthesis of new 7-oxycoumarin derivatives as potent and selective monoamine oxidase A inhibitors. J Med Chem 55:10424-36 (2012)  
Target
Name:
Amine oxidase [flavin-containing] B
Synonyms:
AOFB_BOVIN MAO-B Monoamine Oxidase Type B (MAO-B) Monoamine oxidase B | Monoamine oxidase type B
Type:
PROTEIN
Mol. Mass.:
58428.94
Organism:
Bos taurus
Description:
ChEMBL_1501478
Residue:
520
  
Inhibitor
Name:
BDBM50400103
Synonyms:
CHEMBL2178985
Type:
Small organic molecule
Emp. Form.:
C22H19ClN2O5S
Mol. Mass.:
458.915
SMILES:
Cc1c(C)c(=O)oc2cc(OCC(=O)NN3C(SCC3=O)c3ccc(Cl)cc3)ccc12
: