Target
Amine oxidase [flavin-containing] B
Ligand
BDBM50400128
Substrate
Meas. Tech.
ChEMBL_878114 (CHEMBL2183304)
Ki
556±n/a nM
Citation
 Abdelhafez, OMAmin, KMAli, HIAbdalla, MMBatran, RZ Synthesis of new 7-oxycoumarin derivatives as potent and selective monoamine oxidase A inhibitors. J Med Chem 55:10424-36 (2012)  
Target
Name:
Amine oxidase [flavin-containing] B
Synonyms:
AOFB_BOVIN MAO-B Monoamine Oxidase Type B (MAO-B) Monoamine oxidase B | Monoamine oxidase type B
Type:
PROTEIN
Mol. Mass.:
58428.94
Organism:
Bos taurus
Description:
ChEMBL_1501478
Residue:
520
  
Inhibitor
Name:
BDBM50400128
Synonyms:
CHEMBL2178992
Type:
Small organic molecule
Emp. Form.:
C19H23N3O4S
Mol. Mass.:
389.469
SMILES:
CCN(CC)CCSc1nnc(COc2ccc3c(C)cc(=O)oc3c2)o1
: