Target
Cathepsin E
Ligand
BDBM50400210
Substrate
Meas. Tech.
ChEMBL_878949 (CHEMBL2185512)
IC50
1520±n/a nM
Citation
 Liu, YZhang, WLi, LSalvador, LAChen, TChen, WFelsenstein, KMLadd, TBPrice, ARGolde, TEHe, JXu, YLi, YLuesch, H Cyanobacterial peptides as a prototype for the design of potentß-secretase inhibitors and the development of selective chemical probes for other aspartic proteases. J Med Chem 55:10749-65 (2012)  
Target
Name:
Cathepsin E
Synonyms:
3.4.23.34 CTSE Cathepsin E form II
Type:
Enzyme
Mol. Mass.:
43298.99
Organism:
Homo sapiens (Human)
Description:
P14091
Residue:
396
  
Inhibitor
Name:
BDBM50400210
Synonyms:
CHEMBL2181014
Type:
Small organic molecule
Emp. Form.:
C33H46N4O7
Mol. Mass.:
610.7409
SMILES:
COC(=O)[C@@H](Cc1ccccc1)N(C)C(=O)[C@H](C)NC(=O)[C@H](CC(C)C)NC(=O)C[C@H](O)[C@H](Cc1ccccc1)NC(C)=O
: