Target
Pantothenate synthetase
Ligand
BDBM50400278
Substrate
Meas. Tech.
ChEMBL_872581 (CHEMBL2183383)
Kd
80000±n/a nM
Citation
 Škedelj, VTomašic, TMašic, LPZega, A ATP-binding site of bacterial enzymes as a target for antibacterial drug design. J Med Chem 54:915-29 (2011)  
Target
Name:
Pantothenate synthetase
Synonyms:
Chain A, Crystal Structure Of A Pantothenate Synthetase, Apo Enzyme In C2 Space Group Pantothenate synthetase | panC
Type:
Mol. Mass.:
32675.10
Organism:
Mycobacterium tuberculosis (strain ATCC 25618 / H37Rv)
Description:
ChEMBL_102878
Residue:
309
  
Inhibitor
Name:
BDBM50400278
Synonyms:
CHEMBL1230737
Type:
Small organic molecule
Emp. Form.:
C17H18N6O5S2
Mol. Mass.:
450.492
SMILES:
Nc1ncnc2n(cnc12)[C@@H]1O[C@H](CSSCc2cccc(c2)[N+]([O-])=O)[C@@H](O)[C@H]1O
: