Target
Pantothenate synthetase
Ligand
BDBM50400283
Substrate
Meas. Tech.
ChEMBL_872580 (CHEMBL2183382)
Ki
300±n/a nM
Citation
 Škedelj, VTomašic, TMašic, LPZega, A ATP-binding site of bacterial enzymes as a target for antibacterial drug design. J Med Chem 54:915-29 (2011)  
Target
Name:
Pantothenate synthetase
Synonyms:
Chain A, Crystal Structure Of A Pantothenate Synthetase, Apo Enzyme In C2 Space Group Pantothenate synthetase | panC
Type:
Mol. Mass.:
32675.10
Organism:
Mycobacterium tuberculosis (strain ATCC 25618 / H37Rv)
Description:
ChEMBL_102878
Residue:
309
  
Inhibitor
Name:
BDBM50400283
Synonyms:
CHEMBL1230355
Type:
Small organic molecule
Emp. Form.:
C16H25N7O7S
Mol. Mass.:
459.477
SMILES:
CC(C)(C)[C@@H](N)C(=O)NS(=O)(=O)OC[C@H]1O[C@H]([C@H](O)[C@@H]1O)n1cnc2c(N)ncnc12
: