Target
Voltage-dependent L-type calcium channel subunit alpha-1D
Ligand
BDBM50400564
Substrate
Meas. Tech.
ChEMBL_880018 (CHEMBL2212930)
EC50
>100000±n/a nM
Citation
 Liang, MTarr, TBBravo-Altamirano, KValdomir, GRensch, GSwanson, LDeStefino, NRMazzarisi, CMOlszewski, RAWilson, GMMeriney, SDWipf, P Synthesis and biological evaluation of a selective N- and p/q-type calcium channel agonist. ACS Med Chem Lett 3:985-990 (2012)  
Target
Name:
Voltage-dependent L-type calcium channel subunit alpha-1D
Synonyms:
CAC1D_HUMAN CACN4 CACNL1A2 Calcium channel, L type, alpha-1 polypeptide, isoform 2 Voltage-gated L-type calcium channel Voltage-gated calcium channel | Voltage-gated calcium channel subunit alpha Cav1.3
Type:
PROTEIN
Mol. Mass.:
245144.84
Organism:
Homo sapiens (Human)
Description:
ChEMBL_1350501
Residue:
2161
  
Inhibitor
Name:
BDBM50400564
Synonyms:
CHEMBL2206242
Type:
Small organic molecule
Emp. Form.:
C18H26N6OS
Mol. Mass.:
374.504
SMILES:
CCCn1cnc2c(NCc3ccc(C)s3)nc(N[C@H](CC)CO)nc12
: