Target
Neuronal acetylcholine receptor subunit alpha-2/beta-2
Ligand
BDBM82070
Substrate
Meas. Tech.
ChEMBL_880411 (CHEMBL2210094)
Ki
5.5±n/a nM
Citation
 Yu, LFZhang, HKGunosewoyo, HKozikowski, AP From a4ß2 Nicotinic Ligands to the Discovery of s1 Receptor Ligands: Pharmacophore Analysis and Rational Design. ACS Med Chem Lett 3:1054-1058 (2012)  
Target
Name:
Neuronal acetylcholine receptor subunit alpha-2/beta-2
Synonyms:
Neuronal acetylcholine receptor Alpha-2/Beta-2 Neuronal acetylcholine receptor; alpha2/beta2 | Neuronal acetylcholine recetpor; alpha2/beta2
Type:
Protein
Mol. Mass.:
Description:
Components:
This complex has 2 components.
Component 1
Name:
Neuronal acetylcholine receptor subunit alpha-2
Synonyms:
ACHA2_HUMAN Neuronal acetylcholine receptor; alpha2/beta2
Type:
Enzyme Catalytic Domain
Mol. Mass.:
59759.69
Organism:
Homo sapiens (Human)
Description:
Cholinergic, Nicotinic Alpha2Beta2 0 HUMAN::Q15822
Residue:
529
  
Component 2
Name:
Neuronal acetylcholine receptor subunit beta-2
Synonyms:
ACHB2_HUMAN Neuronal acetylcholine receptor protein beta-2 subunit | Nicotinic acetylcholine receptor alpha3/beta2/alpha5
Type:
Protein
Mol. Mass.:
57020.50
Organism:
Homo sapiens (Human)
Description:
P17787
Residue:
502
  
Inhibitor
Name:
BDBM82070
Synonyms:
CAS_29790-52-1 Nicotine-D salicylate US9303017, Nicotine
Type:
Emp. Form.:
C10H14N2
Mol. Mass.:
162.2316
SMILES:
CN1CCC[C@H]1c1cccnc1
: